`install` doesn't have a recursive option

1 job for add/build in 1 minute and 25 seconds (queued for 1 second)
Status Job ID Name Coverage
  Build
failed #4041
package

00:01:25

 
Name Stage Failure
failed
package Build
debian/rules:9: recipe for target 'override_dh_auto_install' failed
make[1]: *** [override_dh_auto_install] Error 1
make[1]: Leaving directory '/builds/debian/nginx-package-build/source'
debian/rules:6: recipe for target 'binary' failed
make: *** [binary] Error 2
dpkg-buildpackage: error: fakeroot debian/rules binary gave error exit status 2
debuild: fatal error at line 1116:
dpkg-buildpackage -rfakeroot -us -uc failed
ERROR: Job failed: exit code 1