Deps

5 jobs for add/gitlab-ci in 4 minutes and 25 seconds (queued for 2 seconds)
Status Job ID Name Coverage
  Test
failed #196
allowed to fail
PHPunit:PHP5.3:MySQL

00:03:28

failed #197
PHPunit:PHP5.6:MySQL

00:04:08

failed #198
PHPunit:PHP7.0:MySQL

00:04:15

failed #199
PHPunit:PHP7.1:MySQL

00:03:59

failed #200
PHPunit:PHP7.2:MySQL

00:04:23

 
Name Stage Failure
failed
PHPunit:PHP7.2:MySQL Test
checking for the location of libpng... no
checking for the location of libz... no
checking for the location of libXpm... no
checking for FreeType 2... no
checking whether to enable JIS-mapped Japanese font support in GD... no
If configure fails try --with-webp-dir=<DIR>
If configure fails try --with-jpeg-dir=<DIR>
configure: error: png.h not found.
ERROR: Job failed: exit code 1
failed
PHPunit:PHP7.0:MySQL Test
checking for the location of libz... no
checking for the location of libXpm... no
checking for FreeType 2... no
checking whether to enable truetype string function in GD... no
checking whether to enable JIS-mapped Japanese font support in GD... no
If configure fails try --with-webp-dir=<DIR>
If configure fails try --with-jpeg-dir=<DIR>
configure: error: png.h not found.
ERROR: Job failed: exit code 1
failed
PHPunit:PHP5.6:MySQL Test
checking for the location of libXpm... no
checking for FreeType 2... no
checking for T1lib support... no
checking whether to enable truetype string function in GD... no
checking whether to enable JIS-mapped Japanese font support in GD... no
If configure fails try --with-vpx-dir=<DIR>
If configure fails try --with-jpeg-dir=<DIR>
configure: error: png.h not found.
ERROR: Job failed: exit code 1
failed
PHPunit:PHP7.1:MySQL Test
checking for the location of libz... no
checking for the location of libXpm... no
checking for FreeType 2... no
checking whether to enable truetype string function in GD... no
checking whether to enable JIS-mapped Japanese font support in GD... no
If configure fails try --with-webp-dir=<DIR>
If configure fails try --with-jpeg-dir=<DIR>
configure: error: png.h not found.
ERROR: Job failed: exit code 1
failed
PHPunit:PHP5.3:MySQL Test
find . -name .libs -a -type d|xargs rm -rf
rm -f libphp.la modules/* libs/*
/bin/bash /usr/src/php/ext/gd/libtool --mode=compile cc -I/usr/src/php/ext/gd/libgd -DHAVE_LIBPNG -DHAVE_LIBJPEG -DHAVE_XPM -DHAVE_LIBFREETYPE -DENABLE_GD_TTF -I. -I/usr/src/php/ext/gd -DPHP_ATOM_INC -I/usr/src/php/ext/gd/include -I/usr/src/php/ext/gd/main -I/usr/src/php/ext/gd -I/usr/local/include/php -I/usr/local/include/php/main -I/usr/local/include/php/TSRM -I/usr/local/include/php/Zend -I/usr/local/include/php/ext -I/usr/local/include/php/ext/date/lib -I/usr/include/freetype2 -DHAVE_CONFIG_H -g -O2 -c /usr/src/php/ext/gd/gd.c -o gd.lo
mkdir .libs
cc -I/usr/src/php/ext/gd/libgd -DHAVE_LIBPNG -DHAVE_LIBJPEG -DHAVE_XPM -DHAVE_LIBFREETYPE -DENABLE_GD_TTF -I. -I/usr/src/php/ext/gd -DPHP_ATOM_INC -I/usr/src/php/ext/gd/include -I/usr/src/php/ext/gd/main -I/usr/src/php/ext/gd -I/usr/local/include/php -I/usr/local/include/php/main -I/usr/local/include/php/TSRM -I/usr/local/include/php/Zend -I/usr/local/include/php/ext -I/usr/local/include/php/ext/date/lib -I/usr/include/freetype2 -DHAVE_CONFIG_H -g -O2 -c /usr/src/php/ext/gd/gd.c -fPIC -DPIC -o .libs/gd.o
/usr/src/php/ext/gd/gd.c:82:24: fatal error: ft2build.h: No such file or directory
compilation terminated.
make: *** [gd.lo] Error 1
ERROR: Job failed: exit code 1