Debug

5 jobs for add/gitlab-ci in 19 minutes and 13 seconds (queued for 2 seconds)
Status Job ID Name Coverage
  Test
failed #206
allowed to fail
PHPunit:PHP5.3:MySQL

00:02:58

failed #207
PHPunit:PHP5.6:MySQL

00:04:13

failed #208
PHPunit:PHP7.0:MySQL

00:04:12

failed #209
PHPunit:PHP7.1:MySQL

00:04:26

failed #210
PHPunit:PHP7.2:MySQL

00:19:11

 
Name Stage Failure
failed
PHPunit:PHP7.2:MySQL Test
checking for re2c... re2c
checking for re2c version... 0.16 (ok)
checking for gawk... no
checking for nawk... nawk
checking if nawk is broken... no
checking for BZip2 support... yes, shared
checking for BZip2 in default path... not found
configure: error: Please reinstall the BZip2 distribution
ERROR: Job failed: exit code 1
failed
PHPunit:PHP7.1:MySQL Test
checking for re2c... re2c
checking for re2c version... 0.16 (ok)
checking for gawk... no
checking for nawk... nawk
checking if nawk is broken... no
checking for BZip2 support... yes, shared
checking for BZip2 in default path... not found
configure: error: Please reinstall the BZip2 distribution
ERROR: Job failed: exit code 1
failed
PHPunit:PHP5.6:MySQL Test
checking for re2c... re2c
checking for re2c version... 0.16 (ok)
checking for gawk... no
checking for nawk... nawk
checking if nawk is broken... no
checking for BZip2 support... yes, shared
checking for BZip2 in default path... not found
configure: error: Please reinstall the BZip2 distribution
ERROR: Job failed: exit code 1
failed
PHPunit:PHP7.0:MySQL Test
checking for re2c... re2c
checking for re2c version... 0.16 (ok)
checking for gawk... no
checking for nawk... nawk
checking if nawk is broken... no
checking for BZip2 support... yes, shared
checking for BZip2 in default path... not found
configure: error: Please reinstall the BZip2 distribution
ERROR: Job failed: exit code 1
failed
PHPunit:PHP5.3:MySQL Test
find . -name .libs -a -type d|xargs rm -rf
rm -f libphp.la modules/* libs/*
/bin/bash /usr/src/php/ext/gd/libtool --mode=compile cc -I/usr/src/php/ext/gd/libgd -DHAVE_LIBPNG -DHAVE_LIBJPEG -DHAVE_XPM -DHAVE_LIBFREETYPE -DENABLE_GD_TTF -I. -I/usr/src/php/ext/gd -DPHP_ATOM_INC -I/usr/src/php/ext/gd/include -I/usr/src/php/ext/gd/main -I/usr/src/php/ext/gd -I/usr/local/include/php -I/usr/local/include/php/main -I/usr/local/include/php/TSRM -I/usr/local/include/php/Zend -I/usr/local/include/php/ext -I/usr/local/include/php/ext/date/lib -I/usr/include/freetype2 -DHAVE_CONFIG_H -g -O2 -c /usr/src/php/ext/gd/gd.c -o gd.lo
mkdir .libs
cc -I/usr/src/php/ext/gd/libgd -DHAVE_LIBPNG -DHAVE_LIBJPEG -DHAVE_XPM -DHAVE_LIBFREETYPE -DENABLE_GD_TTF -I. -I/usr/src/php/ext/gd -DPHP_ATOM_INC -I/usr/src/php/ext/gd/include -I/usr/src/php/ext/gd/main -I/usr/src/php/ext/gd -I/usr/local/include/php -I/usr/local/include/php/main -I/usr/local/include/php/TSRM -I/usr/local/include/php/Zend -I/usr/local/include/php/ext -I/usr/local/include/php/ext/date/lib -I/usr/include/freetype2 -DHAVE_CONFIG_H -g -O2 -c /usr/src/php/ext/gd/gd.c -fPIC -DPIC -o .libs/gd.o
/usr/src/php/ext/gd/gd.c:82:24: fatal error: ft2build.h: No such file or directory
compilation terminated.
make: *** [gd.lo] Error 1
ERROR: Job failed: exit code 1