Merge branch 'add/1.17.8' into 'master'

Changelog for 1.17.8

See merge request !8
7 jobs for master in 2 minutes and 16 seconds (queued for 1 second)
Status Name Job ID Coverage
  Build
passed build-deb:buster #7385

00:01:42

passed build-deb:jessie #7383

00:01:52

passed build-deb:stretch #7384

00:01:46

 
  Test
failed test-deb:buster #7388

00:00:12

failed test-deb:jessie #7386

00:00:20

failed test-deb:stretch #7387

00:00:23

 
  Deploy
skipped aptly #7389
 
Name Stage Failure
failed
test-deb:buster Test
Downloading artifacts for build-deb:buster (7385)...
Downloading artifacts from coordinator... ok id=7385 responseStatus=200 OK token=oBLckyY_
Authenticating with credentials from job payload (GitLab Registry)
$ export BUILD_DIR="${CI_PROJECT_DIR}/build-buster"
$ dpkg -i ${BUILD_DIR}/nginx_${NGINX_VERSION_BUSTER}*.deb
dpkg: error: cannot access archive '/builds/debian/nginx-package-build/build-buster/nginx_1.17.9*.deb': No such file or directory
Running after script...

ERROR: Job failed: exit code 1
failed
test-deb:stretch Test
Downloading artifacts for build-deb:stretch (7384)...
Downloading artifacts from coordinator... ok id=7384 responseStatus=200 OK token=XKEEi-yW
Authenticating with credentials from job payload (GitLab Registry)
$ export BUILD_DIR="${CI_PROJECT_DIR}/build-stretch"
$ dpkg -i ${BUILD_DIR}/nginx_${NGINX_VERSION_STRECTH}*.deb
dpkg: error: cannot access archive '/builds/debian/nginx-package-build/build-stretch/nginx_*.deb': No such file or directory
Running after script...

ERROR: Job failed: exit code 1
failed
test-deb:jessie Test
$ export BUILD_DIR="${CI_PROJECT_DIR}/build-jessie"
$ dpkg -i ${BUILD_DIR}/nginx_${NGINX_VERSION_JESSIE}*.deb
dpkg: error processing archive /builds/debian/nginx-package-build/build-jessie/nginx_1.17.9*.deb (--install):
cannot access archive: No such file or directory
Errors were encountered while processing:
/builds/debian/nginx-package-build/build-jessie/nginx_1.17.9*.deb
Running after script...

ERROR: Job failed: exit code 1