Merge branch 'add/OpenSSL_1_1_1g' into 'master'

Changelog for 1.17.10-2

See merge request !13
7 jobs for master in 2 minutes and 3 seconds (queued for 2 seconds)
Status Name Job ID Coverage
  Build
passed build-deb:buster #10595

00:01:44

passed build-deb:jessie #10593

00:01:35

passed build-deb:stretch #10594

00:01:26

 
  Test
failed test-deb:buster #10598

00:00:17

failed test-deb:jessie #10596

00:00:15

failed test-deb:stretch #10597

00:00:17

 
  Deploy
skipped aptly #10599
 
Name Stage Failure
failed
test-deb:stretch Test
Executing "step_script" stage of the job script
$ export BUILD_DIR="${CI_PROJECT_DIR}/build-stretch"
$ dpkg -i ${BUILD_DIR}/nginx_${NGINX_VERSION_STRECTH}*.deb
dpkg: error: cannot access archive '/builds/debian/nginx-package-build/build-stretch/nginx_*.deb': No such file or directory
Running after_script
Running after script...

Cleaning up file based variables
ERROR: Job failed: exit code 1
failed
test-deb:buster Test
Executing "step_script" stage of the job script
$ export BUILD_DIR="${CI_PROJECT_DIR}/build-buster"
$ dpkg -i ${BUILD_DIR}/nginx_${NGINX_VERSION_BUSTER}*.deb
dpkg: error: cannot access archive '/builds/debian/nginx-package-build/build-buster/nginx_1.19.3*.deb': No such file or directory
Running after_script
Running after script...

Cleaning up file based variables
ERROR: Job failed: exit code 1
failed
test-deb:jessie Test
dpkg: error processing archive /builds/debian/nginx-package-build/build-jessie/nginx_1.19.3*.deb (--install):
cannot access archive: No such file or directory
Errors were encountered while processing:
/builds/debian/nginx-package-build/build-jessie/nginx_1.19.3*.deb
Running after_script
Running after script...

Cleaning up file based variables
ERROR: Job failed: exit code 1